Главная страница


ru.linux

 
 - RU.LINUX ---------------------------------------------------------------------
 From : Joker                                2:5020/400     27 Jan 2003  08:16:31
 To : All
 Subject : Спецам, помогите
 -------------------------------------------------------------------------------- 
 
 Если что то компелю например apache или php
 пишет такое. Как боротся с этим?
 (при make в apache_1.3.27 )
 #make
 
 ===> src
 
 make[1]: Entering directory `/a1/apache_1.3.27'
 make[2]: Entering directory `/a1/apache_1.3.27/src'
 
 ===> src/regex
 
 gcc -I.  -I../os/unix -I../include   -DLINUX=22 -I/usr/include/db1 -DMOD_SSL
 =208112 -DUSE_HSREGEX -DEAPI `../apaci` -DPOSIX_MISTAKE   -c -o regcomp.o
 regcomp.c
 In file included from regcomp.c:1:
 /usr/include/sys/types.h:34: parse error before `u_char'
 /usr/include/sys/types.h:34: warning: data definition has no type or storage
 class
 /usr/include/sys/types.h:35: parse error before `u_short'
 /usr/include/sys/types.h:35: warning: data definition has no type or storage
 class
 /usr/include/sys/types.h:36: parse error before `u_int'
 /usr/include/sys/types.h:36: warning: data definition has no type or storage
 class
 /usr/include/sys/types.h:37: parse error before `u_long'
 /usr/include/sys/types.h:37: warning: data definition has no type or storage
 class
 /usr/include/sys/types.h:38: parse error before `quad_t'
 /usr/include/sys/types.h:38: warning: data definition has no type or storage
 class
 /usr/include/sys/types.h:39: parse error before `u_quad_t'
 /usr/include/sys/types.h:39: warning: data definition has no type or storage
 class
 /usr/include/sys/types.h:40: parse error before `fsid_t'
 /usr/include/sys/types.h:40: warning: data definition has no type or storage
 class
 /usr/include/sys/types.h:45: parse error before `loff_t'
 /usr/include/sys/types.h:45: warning: data definition has no type or storage
 class
 /usr/include/sys/types.h:49: parse error before `ino_t'
 /usr/include/sys/types.h:49: warning: data definition has no type or storage
 class
 /usr/include/sys/types.h:61: parse error before `dev_t'
 /usr/include/sys/types.h:61: warning: data definition has no type or storage
 class
 /usr/include/sys/types.h:66: parse error before `gid_t'
 /usr/include/sys/types.h:66: warning: data definition has no type or storage
 class
 /usr/include/sys/types.h:71: parse error before `mode_t'
 /usr/include/sys/types.h:71: warning: data definition has no type or storage
 class
 /usr/include/sys/types.h:76: parse error before `nlink_t'
 /usr/include/sys/types.h:76: warning: data definition has no type or storage
 class
 /usr/include/sys/types.h:81: parse error before `uid_t'
 /usr/include/sys/types.h:81: warning: data definition has no type or storage
 class
 /usr/include/sys/types.h:87: parse error before `off_t'
 /usr/include/sys/types.h:87: warning: data definition has no type or storage
 class
 /usr/include/sys/types.h:99: parse error before `pid_t'
 /usr/include/sys/types.h:99: warning: data definition has no type or storage
 class
 /usr/include/sys/types.h:104: parse error before `id_t'
 /usr/include/sys/types.h:104: warning: data definition has no type or
 storage class
 /usr/include/sys/types.h:109: parse error before `ssize_t'
 /usr/include/sys/types.h:109: warning: data definition has no type or
 storage class
 /usr/include/sys/types.h:115: parse error before `daddr_t'
 /usr/include/sys/types.h:115: warning: data definition has no type or
 storage class
 /usr/include/sys/types.h:116: parse error before `caddr_t'
 /usr/include/sys/types.h:116: warning: data definition has no type or
 storage class
 /usr/include/sys/types.h:122: parse error before `key_t'
 /usr/include/sys/types.h:122: warning: data definition has no type or
 storage class
 In file included from /usr/include/sys/types.h:132,
                  from regcomp.c:1:
 /usr/include/time.h:70: parse error before `time_t'
 /usr/include/time.h:70: warning: data definition has no type or storage
 class
 In file included from /usr/include/sys/types.h:132,
                  from regcomp.c:1:
 /usr/include/time.h:82: parse error before `clockid_t'
 /usr/include/time.h:82: warning: data definition has no type or storage
 class
 In file included from /usr/include/sys/types.h:132,
                  from regcomp.c:1:
 /usr/include/time.h:94: parse error before `timer_t'
 /usr/include/time.h:94: warning: data definition has no type or storage
 class
 In file included from /usr/include/sys/select.h:44,
                  from /usr/include/sys/types.h:215,
                  from regcomp.c:1:
 /usr/include/time.h:108: parse error before `__time_t'
 /usr/include/time.h:108: warning: no semicolon at end of struct or union
 /usr/include/time.h:110: parse error before `}'
 In file included from /usr/include/sys/select.h:46,
                  from /usr/include/sys/types.h:215,
                  from regcomp.c:1:
 /usr/include/bits/time.h:69: parse error before `__time_t'
 /usr/include/bits/time.h:69: warning: no semicolon at end of struct or union
 /usr/include/bits/time.h:70: warning: data definition has no type or storage
 class
 In file included from /usr/include/sys/types.h:215,
                  from regcomp.c:1:
 /usr/include/sys/select.h:49: parse error before `suseconds_t'
 /usr/include/sys/select.h:49: warning: data definition has no type or
 storage class
 /usr/include/sys/select.h:71: `__FD_SETSIZE' undeclared here (not in a
 function)
 /usr/include/sys/select.h:71: size of array `__fds_bits' has non-integer
 type
 In file included from regcomp.c:1:
 /usr/include/sys/types.h:230: parse error before `blkcnt_t'
 /usr/include/sys/types.h:230: warning: data definition has no type or
 storage class
 /usr/include/sys/types.h:234: parse error before `fsblkcnt_t'
 /usr/include/sys/types.h:234: warning: data definition has no type or
 storage class
 /usr/include/sys/types.h:238: parse error before `fsfilcnt_t'
 /usr/include/sys/types.h:238: warning: data definition has no type or
 storage class
 In file included from /usr/include/libio.h:32,
                  from /usr/include/stdio.h:65,
                  from regcomp.c:2:
 /usr/include/_G_config.h:28: parse error before `__off_t'
 /usr/include/_G_config.h:28: warning: no semicolon at end of struct or union
 /usr/include/_G_config.h:30: parse error before `}'
 /usr/include/_G_config.h:30: warning: data definition has no type or storage
 class
 /usr/include/_G_config.h:33: parse error before `__off64_t'
 /usr/include/_G_config.h:33: warning: no semicolon at end of struct or union
 /usr/include/_G_config.h:35: parse error before `}'
 /usr/include/_G_config.h:35: warning: data definition has no type or storage
 class
 In file included from /usr/include/stdio.h:65,
                  from regcomp.c:2:
 /usr/include/libio.h:286: parse error before `__off_t'
 /usr/include/libio.h:286: warning: no semicolon at end of struct or union
 /usr/include/libio.h:305: parse error before `_offset'
 /usr/include/libio.h:305: warning: data definition has no type or storage
 class
 /usr/include/libio.h:318: parse error before `}'
 /usr/include/libio.h:344: parse error before `__io_read_fn'
 /usr/include/libio.h:344: warning: data definition has no type or storage
 class
 /usr/include/libio.h:352: parse error before `__io_write_fn'
 /usr/include/libio.h:353: warning: data definition has no type or storage
 class
 /usr/include/libio.h:361: parse error before `__off64_t'
 /usr/include/libio.h:460: parse error before `_IO_padn'
 /usr/include/libio.h:460: parse error before `__ssize_t'
 /usr/include/libio.h:460: warning: data definition has no type or storage
 class
 /usr/include/libio.h:463: parse error before `_IO_seekoff'
 /usr/include/libio.h:463: parse error before `__off64_t'
 /usr/include/libio.h:463: warning: data definition has no type or storage
 class
 /usr/include/libio.h:464: parse error before `_IO_seekpos'
 /usr/include/libio.h:464: parse error before `__off64_t'
 /usr/include/libio.h:464: warning: data definition has no type or storage
 class
 In file included from regcomp.c:2:
 /usr/include/stdio.h:80: parse error before `fpos_t'
 /usr/include/stdio.h:80: warning: data definition has no type or storage
 class
 In file included from regcomp.c:2:
 /usr/include/stdio.h:497: parse error before `fpos_t'
 /usr/include/stdio.h:500: parse error before `*'
 In file included from regcomp.c:4:
 /usr/include/ctype.h:76: parse error before `*'
 /usr/include/ctype.h:76: warning: data definition has no type or storage
 class
 /usr/include/ctype.h:77: parse error before `*'
 /usr/include/ctype.h:77: warning: data definition has no type or storage
 class
 In file included from regcomp.c:8:
 ../include/hsregex.h:26: parse error before `regoff_t'
 ../include/hsregex.h:26: warning: data definition has no type or storage
 class
 ../include/hsregex.h:34: parse error before `regoff_t'
 ../include/hsregex.h:34: warning: no semicolon at end of struct or union
 ../include/hsregex.h:35: warning: data definition has no type or storage
 class
 ../include/hsregex.h:36: warning: data definition has no type or storage
 class
 ../include/hsregex.h:74: parse error before `regmatch_t'
 make[3]: *** [regcomp.o] Error 1
 make[2]: *** [subdirs] Error 1
 make[2]: Leaving directory `/a1/apache_1.3.27/src'
 make[1]: *** [build-std] Error 2
 make[1]: Leaving directory `/a1/apache_1.3.27'
 make: *** [build] Error 2
 --- ifmail v.2.15dev5
  * Origin: Demos online service (2:5020/400)
 
 

Вернуться к списку тем, сортированных по: возрастание даты  уменьшение даты  тема  автор 

 Тема:    Автор:    Дата:  
 Спецам, помогите   Joker   27 Jan 2003 08:16:31 
Архивное /ru.linux/6577d908d987.html, оценка 2 из 5, голосов 10
Яндекс.Метрика
Valid HTML 4.01 Transitional