|
|
ru.linux- RU.LINUX --------------------------------------------------------------------- From : Dmitry Lipovoi 2:5000/166.17 28 Aug 2002 21:49:16 To : All Subject : make modules --------------------------------------------------------------------------------
При компиляции ядра на стадии сабжа получаю следующий чушняк:
=== Сдесь начался out.tmp ... ==========================================
make -C kernel CFLAGS="-D__KERNEL__ -I/usr/src/linux-2.4.3/include -Wall
-Wstrict-prototypes -O2 -fomit-frame-pointer -fno-strict-aliasing -pipe
-march=i586 -DMODULE -DMODVERSIONS -include
/usr/src/linux-2.4.3/include/linux/modversions.h" MAKING_MODULES=1 modules
make[1]: Entering directory `/usr/src/linux-2.4.3/kernel'
make[1]: Nothing to be done for `modules'.
make[1]: Leaving directory `/usr/src/linux-2.4.3/kernel'
make -C drivers CFLAGS="-D__KERNEL__ -I/usr/src/linux-2.4.3/include -Wall
-Wstrict-prototypes -O2 -fomit-frame-pointer -fno-strict-aliasing -pipe
-march=i586 -DMODULE -DMODVERSIONS -include
/usr/src/linux-2.4.3/include/linux/modversions.h" MAKING_MODULES=1 modules
make[1]: Entering directory `/usr/src/linux-2.4.3/drivers'
make -C atm modules
make[2]: Entering directory `/usr/src/linux-2.4.3/drivers/atm'
/usr/bin/kgcc -D__KERNEL__ -I/usr/src/linux-2.4.3/include -Wall
-Wstrict-prototypes -O2 -fomit-frame-pointer -fno-strict-aliasing -pipe
-march=i586 -DMODULE -DMODVERSIONS -include
/usr/src/linux-2.4.3/include/linux/modversions.h -g -c -o eni.o eni.c
In file included from /usr/src/linux-2.4.3/include/linux/prefetch.h:13,
from /usr/src/linux-2.4.3/include/linux/list.h:6,
from /usr/src/linux-2.4.3/include/linux/module.h:12,
from eni.c:6:
/usr/src/linux-2.4.3/include/asm/processor.h:51: warning: parameter names
(without types) in function declaration
/usr/src/linux-2.4.3/include/asm/processor.h:51: field
`loops_per_jiffy_R_ver_str' declared as a function
/usr/src/linux-2.4.3/include/asm/processor.h:72: nondigits in number and not
hexadecimal
/usr/src/linux-2.4.3/include/asm/processor.h:72: nondigits in number and not
hexadecimal
/usr/src/linux-2.4.3/include/asm/processor.h:72: nondigits in number and not
hexadecimal
/usr/src/linux-2.4.3/include/asm/processor.h:72: parse error before `65dda927'
/usr/src/linux-2.4.3/include/asm/processor.h:72: warning: function declaration
isn't a prototype
/usr/src/linux-2.4.3/include/asm/processor.h:247: nondigits in number and not
hexadecimal
/usr/src/linux-2.4.3/include/asm/processor.h:247: parse error before `7413793a'
/usr/src/linux-2.4.3/include/asm/processor.h:247: warning: function declaration
isn't a prototype
/usr/src/linux-2.4.3/include/asm/processor.h:251: warning: parameter names
(without types) in function declaration
/usr/src/linux-2.4.3/include/asm/processor.h:430: missing white space after
number `7e9'
/usr/src/linux-2.4.3/include/asm/processor.h:430: parse error before `7e9'
/usr/src/linux-2.4.3/include/asm/processor.h:430: `kernel_thread_R_ver_str'
declared as function returning a function
/usr/src/linux-2.4.3/include/asm/processor.h:430: warning: function declaration
isn't a prototype
In file included from eni.c:6:
/usr/src/linux-2.4.3/include/linux/module.h:173: nondigits in number and not
hexadecimal
/usr/src/linux-2.4.3/include/linux/module.h:173: nondigits in number and not
hexadecimal
/usr/src/linux-2.4.3/include/linux/module.h:173: nondigits in number and not
hexadecimal
/usr/src/linux-2.4.3/include/linux/module.h:173: nondigits in number and not
hexadecimal
/usr/src/linux-2.4.3/include/linux/module.h:173: parse error before `62dada05'
/usr/src/linux-2.4.3/include/linux/module.h:173:
`inter_module_register_R_ver_str' declared as function returning a function
/usr/src/linux-2.4.3/include/linux/module.h:173: warning: function declaration
isn't a prototype
/usr/src/linux-2.4.3/include/linux/module.h:174: nondigits in number and not
hexadecimal
/usr/src/linux-2.4.3/include/linux/module.h:174: missing white space after
number `7a9e845'
/usr/src/linux-2.4.3/include/linux/module.h:174: parse error before `7a9e845'
/usr/src/linux-2.4.3/include/linux/module.h:174:
`inter_module_unregister_R_ver_str' declared as function returning a function
/usr/src/linux-2.4.3/include/linux/module.h:174: warning: function declaration
isn't a prototype
/usr/src/linux-2.4.3/include/linux/module.h:175: `inter_module_get_R_ver_str'
declared as function returning a function
/usr/src/linux-2.4.3/include/linux/module.h:175: warning: parameter names
(without types) in function declaration
/usr/src/linux-2.4.3/include/linux/module.h:176:
`inter_module_get_request_R_ver_str' declared as function returning a function
/usr/src/linux-2.4.3/include/linux/module.h:176: warning: parameter names
(without types) in function declaration
/usr/src/linux-2.4.3/include/linux/module.h:177: nondigits in number and not
hexadecimal
/usr/src/linux-2.4.3/include/linux/module.h:177: nondigits in number and not
hexadecimal
/usr/src/linux-2.4.3/include/linux/module.h:177: nondigits in number and not
hexadecimal
/usr/src/linux-2.4.3/include/linux/module.h:177: parse error before `6b99f7d8'
/usr/src/linux-2.4.3/include/linux/module.h:177: `inter_module_put_R_ver_str'
declared as function returning a function
/usr/src/linux-2.4.3/include/linux/module.h:177: warning: function declaration
isn't a prototype
/usr/src/linux-2.4.3/include/linux/module.h:186: `try_inc_mod_count_R_ver_str'
declared as function returning a function
/usr/src/linux-2.4.3/include/linux/module.h:186: warning: parameter names
(without types) in function declaration
/usr/src/linux-2.4.3/include/asm/pgalloc.h: In function `get_pgd_fast':
In file included from /usr/src/linux-2.4.3/include/linux/highmem.h:5,
from /usr/src/linux-2.4.3/include/linux/vmalloc.h:7,
from /usr/src/linux-2.4.3/include/asm/io.h:110,
from /usr/src/linux-2.4.3/include/asm/pci.h:26,
from /usr/src/linux-2.4.3/include/linux/pci.h:560,
from eni.c:10:
/usr/src/linux-2.4.3/include/asm/pgalloc.h:74: `boot_cpu_data_R65dda927'
undeclared (first use in this function)
/usr/src/linux-2.4.3/include/asm/pgalloc.h:74: (Each undeclared identifier is
reported only once
/usr/src/linux-2.4.3/include/asm/pgalloc.h:74: for each function it appears
in.)
/usr/src/linux-2.4.3/include/asm/pgalloc.h: In function `free_pgd_fast':
/usr/src/linux-2.4.3/include/asm/pgalloc.h:85: `boot_cpu_data_R65dda927'
undeclared (first use in this function)
/usr/src/linux-2.4.3/include/asm/pgalloc.h: In function `pte_alloc_one_fast':
/usr/src/linux-2.4.3/include/asm/pgalloc.h:117: `boot_cpu_data_R65dda927'
undeclared (first use in this function)
/usr/src/linux-2.4.3/include/asm/pgalloc.h: In function `pte_free_fast':
/usr/src/linux-2.4.3/include/asm/pgalloc.h:127: `boot_cpu_data_R65dda927'
undeclared (first use in this function)
/usr/src/linux-2.4.3/include/linux/vmalloc.h: In function `vmalloc':
In file included from /usr/src/linux-2.4.3/include/asm/io.h:110,
from /usr/src/linux-2.4.3/include/asm/pci.h:26,
from /usr/src/linux-2.4.3/include/linux/pci.h:560,
from eni.c:10:
/usr/src/linux-2.4.3/include/linux/vmalloc.h:36: `boot_cpu_data_R65dda927'
undeclared (first use in this function)
/usr/src/linux-2.4.3/include/linux/vmalloc.h: In function `vmalloc_dma':
/usr/src/linux-2.4.3/include/linux/vmalloc.h:45: `boot_cpu_data_R65dda927'
undeclared (first use in this function)
/usr/src/linux-2.4.3/include/linux/vmalloc.h: In function `vmalloc_32':
/usr/src/linux-2.4.3/include/linux/vmalloc.h:54: `boot_cpu_data_R65dda927'
undeclared (first use in this function)
make[2]: *** [eni.o] Error 1
make[2]: Leaving directory `/usr/src/linux-2.4.3/drivers/atm'
make[1]: *** [_modsubdir_atm] Error 2
make[1]: Leaving directory `/usr/src/linux-2.4.3/drivers'
make: *** [_mod_drivers] Error 2
=== ... а сдесь out.tmp закончился ====================================
Что это? Кривая /конфигурация ядра/? Кривое /ядро/? Кривые /руки/?
ps: make bzImage компилирует нормально. Даже загрузиться получается :)
See U!
... Мне что-же, снова киллерам звонить?
--- GoldED+/LNX 1.1.5-20010807
* Origin: [ HCI NSU ][ ASM ][ C++ ][ WAR CRAFT 3 ][ HIP-HOP ] (2:5000/166.17)
Вернуться к списку тем, сортированных по: возрастание даты уменьшение даты тема автор
Архивное /ru.linux/39423d6cf2d9.html, оценка из 5, голосов 10
|